Updated 9 minutes ago (refreshed every 10 minutes).

Main Builds

The build is still failing:

The build is still failing:

Unfortunately, the build failed:

Unfortunately, the build failed:

The build is still failing:

The build failed. Click for more details:

Failing Jobs - Building 50a0221

Status Name Step Failures Logs Raw logs
JVM Tests - JDK 11 Build Failures Logs Raw logs
JVM Tests - JDK 11 Windows Build Failures Logs Raw logs
JVM Tests - JDK 17 Build Failures Logs Raw logs
JVM Tests - JDK 17 MacOS M1 Build Failures Logs Raw logs
JVM Tests - JDK 18 Build Failures Logs Raw logs
MicroProfile TCKs Tests Verify Failures Logs Raw logs
Quickstarts Compilation - JDK 17 Compile Quickstarts ⚠️ Check → Logs Raw logs

Full information is available in the Build summary check run.

Failures

⚙️ JVM Tests - JDK 11 #

- Failing: extensions/redis-client/runtime extensions/resteasy-reactive/quarkus-resteasy-reactive/deployment 
! Skipped: extensions/avro/deployment extensions/csrf-reactive/deployment extensions/grpc/deployment and 131 more

📦 extensions/redis-client/runtime

io.quarkus.redis.datasource.SearchCommandsTest.testAggregation line 452 - More details - Source on GitHub

org.awaitility.core.ConditionTimeoutException: 
Assertion condition defined as a lambda expression in io.quarkus.redis.datasource.SearchCommandsTest 
expected: 3

📦 extensions/resteasy-reactive/quarkus-resteasy-reactive/deployment

io.quarkus.resteasy.reactive.server.test.customproviders.ConditionalBeanFiltersTest. - More details - Source on GitHub

java.lang.RuntimeException: 
java.lang.RuntimeException: io.quarkus.builder.BuildException: Build failure: Build failed due to errors
	[error]: Build step io.quarkus.arc.deployment.ArcProcessor#validate threw an exception: jakarta.enterprise.inject.spi.DeploymentException: Found 14 deployment problems:

⚙️ JVM Tests - JDK 11 Windows #

- Failing: extensions/resteasy-reactive/quarkus-resteasy-reactive/deployment 
! Skipped: extensions/avro/deployment extensions/csrf-reactive/deployment extensions/grpc/deployment and 127 more

📦 extensions/resteasy-reactive/quarkus-resteasy-reactive/deployment

io.quarkus.resteasy.reactive.server.test.customproviders.ConditionalBeanFiltersTest. - More details - Source on GitHub

java.lang.RuntimeException: 
java.lang.RuntimeException: io.quarkus.builder.BuildException: Build failure: Build failed due to errors
	[error]: Build step io.quarkus.arc.deployment.ArcProcessor#validate threw an exception: jakarta.enterprise.inject.spi.DeploymentException: Found 14 deployment problems:

⚙️ JVM Tests - JDK 17 #

- Failing: extensions/redis-client/runtime extensions/resteasy-reactive/quarkus-resteasy-reactive/deployment 
! Skipped: extensions/avro/deployment extensions/csrf-reactive/deployment extensions/grpc/deployment and 132 more

📦 extensions/redis-client/runtime

io.quarkus.redis.datasource.SearchCommandsTest.testAggregation line 452 - More details - Source on GitHub

org.awaitility.core.ConditionTimeoutException: 
Assertion condition defined as a io.quarkus.redis.datasource.SearchCommandsTest 
expected: 3

📦 extensions/resteasy-reactive/quarkus-resteasy-reactive/deployment

io.quarkus.resteasy.reactive.server.test.customproviders.ConditionalBeanFiltersTest. - More details - Source on GitHub

java.lang.RuntimeException: 
java.lang.RuntimeException: io.quarkus.builder.BuildException: Build failure: Build failed due to errors
	[error]: Build step io.quarkus.arc.deployment.ArcProcessor#validate threw an exception: jakarta.enterprise.inject.spi.DeploymentException: Found 14 deployment problems:

⚙️ JVM Tests - JDK 17 MacOS M1 #

- Failing: extensions/resteasy-reactive/quarkus-resteasy-reactive/deployment 
! Skipped: extensions/avro/deployment extensions/csrf-reactive/deployment extensions/grpc/deployment and 128 more

📦 extensions/resteasy-reactive/quarkus-resteasy-reactive/deployment

io.quarkus.resteasy.reactive.server.test.customproviders.ConditionalBeanFiltersTest. - More details - Source on GitHub

java.lang.RuntimeException: 
java.lang.RuntimeException: io.quarkus.builder.BuildException: Build failure: Build failed due to errors
	[error]: Build step io.quarkus.arc.deployment.ArcProcessor#validate threw an exception: jakarta.enterprise.inject.spi.DeploymentException: Found 14 deployment problems:

⚙️ JVM Tests - JDK 18 #

- Failing: extensions/redis-client/runtime extensions/resteasy-reactive/quarkus-resteasy-reactive/deployment 
! Skipped: extensions/avro/deployment extensions/csrf-reactive/deployment extensions/grpc/deployment and 132 more

📦 extensions/redis-client/runtime

io.quarkus.redis.datasource.SearchCommandsTest.testAggregation line 452 - More details - Source on GitHub

org.awaitility.core.ConditionTimeoutException: 
Assertion condition defined as a io.quarkus.redis.datasource.SearchCommandsTest 
expected: 3

📦 extensions/resteasy-reactive/quarkus-resteasy-reactive/deployment

io.quarkus.resteasy.reactive.server.test.customproviders.ConditionalBeanFiltersTest. - More details - Source on GitHub

java.lang.RuntimeException: 
java.lang.RuntimeException: io.quarkus.builder.BuildException: Build failure: Build failed due to errors
	[error]: Build step io.quarkus.arc.deployment.ArcProcessor#validate threw an exception: jakarta.enterprise.inject.spi.DeploymentException: Found 14 deployment problems:

⚙️ MicroProfile TCKs Tests #

- Failing: tcks/microprofile-rest-client 

📦 tcks/microprofile-rest-client

org.eclipse.microprofile.rest.client.tck.timeout.TimeoutBuilderIndependentOfMPConfigTest.testConnectTimeout - More details - Source on GitHub

org.testng.TestException: 

Expected exception of type class jakarta.ws.rs.ProcessingException but got java.lang.AssertionError: Elapsed time expected under 5030ms, but was 10133ms. expected [true] but found [false]

org.eclipse.microprofile.rest.client.tck.timeout.TimeoutTest.testConnectTimeout - More details - Source on GitHub

org.testng.TestException: 

Expected exception of type class jakarta.ws.rs.ProcessingException but got java.lang.AssertionError: Elapsed time expected under 5030ms, but was 10129ms. expected [true] but found [false]

org.eclipse.microprofile.rest.client.tck.timeout.TimeoutViaMPConfigTest.testConnectTimeout - More details - Source on GitHub

org.testng.TestException: 

Expected exception of type class jakarta.ws.rs.ProcessingException but got java.lang.AssertionError: Elapsed time expected under 7030ms, but was 14040ms. expected [true] but found [false]

org.eclipse.microprofile.rest.client.tck.timeout.TimeoutViaMPConfigTest.testReadTimeout - More details - Source on GitHub

org.testng.TestException: 

Expected exception of type class jakarta.ws.rs.ProcessingException but got java.lang.AssertionError: Elapsed time expected under 7030ms, but was 14019ms. expected [true] but found [false]

org.eclipse.microprofile.rest.client.tck.timeout.TimeoutViaMPConfigWithConfigKeyTest.testConnectTimeout - More details - Source on GitHub

org.testng.TestException: 

Expected exception of type class jakarta.ws.rs.ProcessingException but got java.lang.AssertionError: Elapsed time expected under 7030ms, but was 14031ms. expected [true] but found [false]

org.eclipse.microprofile.rest.client.tck.timeout.TimeoutViaMPConfigWithConfigKeyTest.testReadTimeout - More details - Source on GitHub

org.testng.TestException: 

Expected exception of type class jakarta.ws.rs.ProcessingException but got java.lang.AssertionError: Elapsed time expected under 7030ms, but was 14012ms. expected [true] but found [false]
Platform

The build is still failing:

The build is still failing:

The build is still failing:

The build is still failing:

Quarkiverse

The build is still failing:

The build is still failing:

The build is still failing: